# GUI Build Fails in Fedora Linux

**URL:** <https://bisq.community/t/gui-build-fails-in-fedora-linux/2668>\
**Category:** Support\
**Created:** [August 10, 2017, 7:10am UTC](https://bisq.community/t/gui-build-fails-in-fedora-linux/2668 "2017-08-10T07:10:04Z")\
**Posts on this page:** 1\
**Page:** 1

<div class="post-metadata">

**Author:** ![maxmoney](https://bisq.community/letter_avatar/maxmoney/32/5_5575768a8748004e209b776fc1b2916d.png) [@maxmoney](https://bisq.community/u/maxmoney)\
**Post date:** [August 10, 2017, 7:10am UTC](https://bisq.community/t/gui-build-fails-in-fedora-linux/2668/1 "2017-08-10T07:10:04Z")

</div>

Failure during build on Fedora Linux:

[INFO] Verifying URN: uk.co.froot.maven.enforcer:digest-enforcer-rules:0.0.1:jar:null:runtime:16a9e04f3fe4bb143c42782d07d5faf65b32106f  
[WARNING] Rule 1: uk.co.froot.maven.enforcer.DigestRule failed with message:  
At least one artifact has not met expectations. You should manually verify the integrity of the affected artifacts against trusted sources.  
[INFO] ------------------------------------------------------------------------  
[INFO] Reactor Summary:  
[INFO]  
[INFO] parent … SUCCESS [0.195 s]  
[INFO] common … SUCCESS [01:10 min]  
[INFO] jsocks … SUCCESS [1.869 s]  
[INFO] jtorctl … SUCCESS [1.023 s]  
[INFO] jtorproxy … SUCCESS [3.547 s]  
[INFO] network … SUCCESS [6.984 s]  
[INFO] core … SUCCESS [17.236 s]  
[INFO] gui … FAILURE [01:01 min]  
[INFO] seednode … SKIPPED  
[INFO] statistics … SKIPPED  
[INFO] provider … SKIPPED  
[INFO] ------------------------------------------------------------------------  
[INFO] BUILD FAILURE  
[INFO] ------------------------------------------------------------------------  
[INFO] Total time: 02:43 min  
[INFO] Finished at: 2017-08-10T08:08:15+01:00  
[INFO] Final Memory: 53M/678M  
[INFO] ------------------------------------------------------------------------  
[ERROR] Failed to execute goal org.apache.maven.plugins:maven-enforcer-plugin:1.4.1:enforce (enforce) on project gui: Some Enforcer rules have failed. Look above for specific messages explaining why the rule failed. -\> [Help 1]  
[ERROR]  
[ERROR] To see the full stack trace of the errors, re-run Maven with the -e switch.  
[ERROR] Re-run Maven using the -X switch to enable full debug logging.  
[ERROR]  
[ERROR] For more information about the errors and possible solutions, please read the following articles:  
[ERROR] [Help 1] [http://cwiki.apache.org/confluence/display/MAVEN/MojoExecutionException](http://cwiki.apache.org/confluence/display/MAVEN/MojoExecutionException)  
[ERROR]  
[ERROR] After correcting the problems, you can resume the build with the command  
[ERROR] mvn -rf :gui  
[root@linux bitsquare-0.5.3]#
